Reaction Details
TargetMitogen-activated protein kinase kinase kinase 5
LigandBDBM50212284
Substrate/Competitorn/a
Meas. Tech.ChEMBL_1636848 (CHEMBL3879746)
IC50 13±n/a nM
Citation Lanier, MPickens, JBigi, SVBradshaw-Pierce, ELChambers, ACheruvallath, ZSCole, DDougan, DRErmolieff, JGibson, THalkowycz, PHirokawa, AIvetac, AMiura, JNunez, ESabat, MTyhonas, JWang, HWang, XSwann, S Structure-Based Design of ASK1 Inhibitors as Potential Agents for Heart Failure. ACS Med Chem Lett8:316-320 (2017) 
 
Mitogen-activated protein kinase kinase kinase 5
Name:Mitogen-activated protein kinase kinase kinase 5
Type:Protein
Mol. Mass.:154514.93
Organism:Homo sapiens (Human)
Description:Q99683
Residue:1374
BDBM50212284
NameBDBM50212284
Synonyms:CHEMBL3925645
TypeSmall organic molecule
Emp. Form.C18H16FN5O
Mol. Mass.337.3509
SMILESCC(CF)n1cnnc1-c1cccc(n1)N1Cc2ccccc2C1=O