Reaction Details
TargetMitogen-activated protein kinase kinase kinase 5
LigandBDBM50212285
Substrate/Competitorn/a
Meas. Tech.ChEMBL_1636848 (CHEMBL3879746)
IC50 50±n/a nM
Citation Lanier, MPickens, JBigi, SVBradshaw-Pierce, ELChambers, ACheruvallath, ZSCole, DDougan, DRErmolieff, JGibson, THalkowycz, PHirokawa, AIvetac, AMiura, JNunez, ESabat, MTyhonas, JWang, HWang, XSwann, S Structure-Based Design of ASK1 Inhibitors as Potential Agents for Heart Failure. ACS Med Chem Lett8:316-320 (2017) 
 
Mitogen-activated protein kinase kinase kinase 5
Name:Mitogen-activated protein kinase kinase kinase 5
Type:Protein
Mol. Mass.:154514.93
Organism:Homo sapiens (Human)
Description:Q99683
Residue:1374
BDBM50212285
NameBDBM50212285
Synonyms:CHEMBL3891901
TypeSmall organic molecule
Emp. Form.C18H18FN5O
Mol. Mass.339.3668
SMILESCC(C)n1cnnc1-c1cccc(NC(=O)c2ccc(C)cc2F)n1