Reaction Details
TargetVoltage-dependent L-type calcium channel subunit alpha-1S
LigandBDBM50029431
Substrate/Competitorn/a
Meas. Tech.ChEMBL_42938 (CHEMBL654580)
Ki 118±n/a nM
Citation  TBA Bioorg Med Chem Lett2:1193-1198 (1992)  
 
Voltage-dependent L-type calcium channel subunit alpha-1S
Name:Voltage-dependent L-type calcium channel subunit alpha-1S
Type:PROTEIN
Mol. Mass.:210392.58
Organism:Rattus norvegicus
Description:ChEMBL_92777
Residue:1850
BDBM50029431
NameBDBM50029431
Synonyms:CHEMBL277293 | Dimethyl-(4-phenyl-4H-benzo[b]pyrrolo[1,2-d][1,4]thiazin-1-ylmethyl)-amine
TypeSmall organic molecule
Emp. Form.C20H20N2S
Mol. Mass.320.451
SMILESCN(C)Cc1ccc2C(Sc3ccccc3-n12)c1ccccc1