Reaction Details
TargetVoltage-dependent L-type calcium channel subunit alpha-1S
LigandBDBM50029426
Substrate/Competitorn/a
Meas. Tech.ChEMBL_42938 (CHEMBL654580)
Ki 19±n/a nM
Citation  TBA Bioorg Med Chem Lett2:1193-1198 (1992)  
 
Voltage-dependent L-type calcium channel subunit alpha-1S
Name:Voltage-dependent L-type calcium channel subunit alpha-1S
Type:PROTEIN
Mol. Mass.:210392.58
Organism:Rattus norvegicus
Description:ChEMBL_92777
Residue:1850
BDBM50029426
NameBDBM50029426
Synonyms:CHEMBL24675 | [2-(3,4-Dimethoxy-phenyl)-ethyl]-[4-(4-methoxy-phenyl)-4H-benzo[b]pyrrolo[1,2-d][1,4]thiazin-1-ylmethyl]-methyl-amine
TypeSmall organic molecule
Emp. Form.C30H32N2O3S
Mol. Mass.500.652
SMILESCOc1ccc(cc1)C1Sc2ccccc2-n2c(CN(C)CCc3ccc(OC)c(OC)c3)ccc12