Reaction Details
TargetcAMP-dependent protein kinase catalytic subunit gamma
LigandBDBM50054426
Substrate/Competitorn/a
Meas. Tech.ChEMBL_161896 (CHEMBL772605)
IC50 34000±n/a nM
Citation  TBA Bioorg Med Chem Lett2:449-452 (1992)  
 
cAMP-dependent protein kinase catalytic subunit gamma
Name:cAMP-dependent protein kinase catalytic subunit gamma
Type:PROTEIN
Mol. Mass.:40442.03
Organism:Homo sapiens (Human)
Description:ChEMBL_104720
Residue:351
BDBM50054426
NameBDBM50054426
Synonyms:7-hydroxy-6,7,12,13-tetrahydro-5H-indolo[2,3-a]pyrrolo[3,4-c]carbazol-5-one | CHEMBL127277
TypeSmall organic molecule
Emp. Form.C20H13N3O2
Mol. Mass.327.3361
SMILESOC1NC(=O)c2c1c1c3ccccc3[nH]c1c1[nH]c3ccccc3c21