Reaction Details
TargetLeukotriene B4 receptor 1/2
LigandBDBM50212631
Substrate/Competitorn/a
Meas. Tech.ChEMBL_98507 (CHEMBL709169)
Ki 244±n/a nM
Citation  TBA Bioorg Med Chem Lett3:1985-1990 (1993)  
 
Leukotriene B4 receptor 1/2
Name:Leukotriene B4 receptor 1/2
Synonyms:Leukotriene B4 receptor
Type:n/a
Mol. Mass.:n/a
Description:ASSAY_ID of ChEMBL is 88360
Components:This complex has 2 components.
Component 1
Name:Leukotriene B4 receptor 2
Type:Enzyme Catalytic Domain
Mol. Mass.:37964.86
Organism:Homo sapiens (Human)
Description:Leukotriene 2 0 HUMAN::Q9NPC1
Residue:358
Component 2
Name:Leukotriene B4 receptor 1
Synonyms:BLT BLTR Chemoattractant receptor-like 1 GPR16 LTB4-R 1 Leukotriene B4 R1 Leukotriene B4 receptor 1 P2Y purinoceptor 7 | P2Y7
Type:Enzyme Catalytic Domain
Mol. Mass.:37582.68
Organism:Homo sapiens (Human)
Description:Q15722
Residue:352
BDBM50212631
NameBDBM50212631
Synonyms:CHEMBL61913
TypeSmall organic molecule
Emp. Form.C30H33NaO7
Mol. Mass.528.5686
SMILES[Na+].CCCc1c(OCCCOc2cc(O)c(cc2CC)C(C)=O)cccc1OCc1ccccc1C([O-])=O