Reaction Details
TargetBeta-lactamase BRO-1
LigandBDBM50212646
Substrate/Competitorn/a
Meas. Tech.ChEMBL_40225 (CHEMBL653998)
IC50 13.1±n/a nM
Citation  TBA Bioorg Med Chem Lett3:2247-2252 (1993)  
 
Beta-lactamase BRO-1
Name:Beta-lactamase BRO-1
Type:PROTEIN
Mol. Mass.:35383.81
Organism:Moraxella catarrhalis
Description:ChEMBL_104100
Residue:313
BDBM50212646
NameBDBM50212646
Synonyms:CHEMBL72972
TypeSmall organic molecule
Emp. Form.C15H15N3O5S2
Mol. Mass.381.427
SMILES[H][C@@]12CC(=O)N1[C@@H](C(O)=O)[C@](C)(CSc1nc3ccccc3[nH]1)S2(=O)=O