Reaction Details
TargetBeta-lactamase BRO-1
LigandBDBM50212643
Substrate/Competitorn/a
Meas. Tech.ChEMBL_40225 (CHEMBL653998)
IC50 56.1±n/a nM
Citation  TBA Bioorg Med Chem Lett3:2247-2252 (1993)  
 
Beta-lactamase BRO-1
Name:Beta-lactamase BRO-1
Type:PROTEIN
Mol. Mass.:35383.81
Organism:Moraxella catarrhalis
Description:ChEMBL_104100
Residue:313
BDBM50212643
NameBDBM50212643
Synonyms:CHEMBL308516
TypeSmall organic molecule
Emp. Form.C15H13BrN2O3S3
Mol. Mass.445.374
SMILES[H][C@]12S[C@@](C)(CSc3nc4ccccc4s3)[C@@H](N1C(=O)[C@H]2Br)C(O)=O