Reaction Details
TargetBeta-lactamase BRO-1
LigandBDBM50212645
Substrate/Competitorn/a
Meas. Tech.ChEMBL_40225 (CHEMBL653998)
IC50 65.9±n/a nM
Citation  TBA Bioorg Med Chem Lett3:2247-2252 (1993)  
 
Beta-lactamase BRO-1
Name:Beta-lactamase BRO-1
Type:PROTEIN
Mol. Mass.:35383.81
Organism:Moraxella catarrhalis
Description:ChEMBL_104100
Residue:313
BDBM50212645
NameBDBM50212645
Synonyms:CHEMBL305908
TypeSmall organic molecule
Emp. Form.C10H11BrN4O3S2
Mol. Mass.379.253
SMILES[H][C@]12S[C@@](C)(CSc3nc[nH]n3)[C@@H](N1C(=O)[C@H]2Br)C(O)=O