Reaction Details
TargetBeta-lactamase SHV-1
LigandBDBM50212634
Substrate/Competitorn/a
Meas. Tech.ChEMBL_40707 (CHEMBL654919)
IC50 104±n/a nM
Citation  TBA Bioorg Med Chem Lett3:2247-2252 (1993)  
 
Beta-lactamase SHV-1
Name:Beta-lactamase SHV-1
Type:Protein
Mol. Mass.:31226.68
Organism:Klebsiella pneumoniae (Enterobacteria)
Description:4R3B
Residue:286
BDBM50212634
NameBDBM50212634
Synonyms:CHEMBL309009
TypeSmall organic molecule
Emp. Form.C15H14N2O6S2
Mol. Mass.382.411
SMILES[H][C@@]12CC(=O)N1[C@@H](C(O)=O)[C@](C)(CSc1nc3ccccc3o1)S2(=O)=O