Reaction Details
TargetBeta-lactamase SHV-1
LigandBDBM50212637
Substrate/Competitorn/a
Meas. Tech.ChEMBL_40707 (CHEMBL654919)
IC50 370±n/a nM
Citation  TBA Bioorg Med Chem Lett3:2247-2252 (1993)  
 
Beta-lactamase SHV-1
Name:Beta-lactamase SHV-1
Type:Protein
Mol. Mass.:31226.68
Organism:Klebsiella pneumoniae (Enterobacteria)
Description:4R3B
Residue:286
BDBM50212637
NameBDBM50212637
Synonyms:CHEMBL72046
TypeSmall organic molecule
Emp. Form.C11H14N2O5S3
Mol. Mass.350.434
SMILES[H][C@@]12CC(=O)N1[C@@H](C(O)=O)[C@](C)(CSC1=NCCS1)S2(=O)=O