Reaction Details
TargetBeta-lactamase SHV-1
LigandBDBM50212640
Substrate/Competitorn/a
Meas. Tech.ChEMBL_40707 (CHEMBL654919)
IC50 577±n/a nM
Citation  TBA Bioorg Med Chem Lett3:2247-2252 (1993)  
 
Beta-lactamase SHV-1
Name:Beta-lactamase SHV-1
Type:Protein
Mol. Mass.:31226.68
Organism:Klebsiella pneumoniae (Enterobacteria)
Description:4R3B
Residue:286
BDBM50212640
NameBDBM50212640
Synonyms:CHEMBL423309
TypeSmall organic molecule
Emp. Form.C11H14N4O5S2
Mol. Mass.346.383
SMILES[H][C@@]12CC(=O)N1[C@@H](C(O)=O)[C@](C)(CSc1nncn1C)S2(=O)=O