Reaction Details
TargetBeta-lactamase BRO-1
LigandBDBM50212641
Substrate/Competitorn/a
Meas. Tech.ChEMBL_40225 (CHEMBL653998)
IC50 10.7±n/a nM
Citation  TBA Bioorg Med Chem Lett3:2247-2252 (1993)  
 
Beta-lactamase BRO-1
Name:Beta-lactamase BRO-1
Type:PROTEIN
Mol. Mass.:35383.81
Organism:Moraxella catarrhalis
Description:ChEMBL_104100
Residue:313
BDBM50212641
NameBDBM50212641
Synonyms:Brobactam
TypeSmall organic molecule
Emp. Form.C8H10BrNO3S
Mol. Mass.280.139
SMILES[H][C@]12SC(C)(C)[C@@H](N1C(=O)[C@H]2Br)C(O)=O