Reaction Details
TargetMelatonin receptor type 1A/1B/1C
LigandBDBM50282747
Substrate/Competitorn/a
Meas. Tech.ChEMBL_104753 (CHEMBL712436)
Ki 153±n/a nM
Citation  TBA Bioorg Med Chem Lett4:1555-1558 (1994)  
 
Melatonin receptor type 1A/1B/1C
Name:Melatonin receptor type 1A/1B/1C
Synonyms:Melatonin receptor
Type:n/a
Mol. Mass.:n/a
Description:ASSAY_ID of ChEMBL is 104753
Components:This complex has 3 components.
Component 1
Name:Melatonin receptor type 1A
Type:PROTEIN
Mol. Mass.:39911.03
Organism:Gallus gallus
Description:ChEMBL_104739
Residue:353
Component 2
Name:Melatonin receptor type 1B
Synonyms:MEL-1B-R Melatonin Melatonin receptor type 1B
Type:Enzyme Catalytic Domain
Mol. Mass.:33012.73
Organism:Chick
Description:Melatonin 0 Chick::P51050
Residue:289
Component 3
Name:Melatonin receptor type 1C
Synonyms:CKB Mel-1C-R Melatonin receptor type 1C
Type:PROTEIN
Mol. Mass.:38595.98
Organism:Gallus gallus
Description:ChEMBL_104739
Residue:346
BDBM50282747
NameBDBM50282747
Synonyms:2-Bromo-N-[2-(1H-indol-3-yl)-ethyl]-acetamide CHEMBL290406
TypeSmall organic molecule
Emp. Form.C12H13BrN2O
Mol. Mass.281.148
SMILESBrCC(=O)NCCc1c[nH]c2ccccc12