Reaction Details
TargetPBP2A
LigandBDBM50213269
Substrate/Competitorn/a
Meas. Tech.ChEMBL_153662 (CHEMBL757854)
IC50 2.76e+03±n/a nM
Citation  TBA Bioorg Med Chem Lett5:1427-1432 (1995)  
 
PBP2A
Name:PBP2A
Type:PROTEIN
Mol. Mass.:76283.66
Organism:Staphylococcus aureus
Description:ChEMBL_105733
Residue:668
BDBM50213269
NameBDBM50213269
Synonyms:CHEMBL430721
TypeSmall organic molecule
Emp. Form.C16H15N2NaO5S3
Mol. Mass.434.485
SMILES[Na+].[H][C@]12[C@@H](C)C(Sc3nc4c(CO)csc4s3)=C(N1C(=O)[C@]2([H])[C@@H](C)O)C([O-])=O