Reaction Details
TargetAlpha-2A/Alpha-2B/Alpha-2C adrenergic receptor
LigandBDBM50052880
Substrate/Competitorn/a
Meas. Tech.ChEMBL_33311 (CHEMBL645607)
Ki 1.3±n/a nM
Citation  Analogs of UK 14,304: Structural features responsible for ?A2 adrenoceptor activity Bioorg Med Chem Lett5:1745-1750 (1995)  
 
Alpha-2A/Alpha-2B/Alpha-2C adrenergic receptor
Name:Alpha-2A/Alpha-2B/Alpha-2C adrenergic receptor
Type:n/a
Mol. Mass.:n/a
Description:ASSAY_ID of ChEMBL is 305672
Components:This complex has 3 components.
Component 1
Name:Alpha-2B adrenergic receptor
Synonyms:ADA2B_HUMAN ADRA2L1 Adrenergic alpha2B Adrenergic receptor alpha Alpha-2 adrenergic receptor subtype C2 Alpha-2B adrenoreceptor | Alpha-2BAR
Type:Enzyme
Mol. Mass.:49964.20
Organism:Homo sapiens (Human)
Description:P18089
Residue:450
Component 2
Name:Alpha-2A adrenergic receptor
Synonyms:ADA2A_HUMAN ADRA2R Adrenergic alpha2A Alpha-2 adrenergic receptor subtype C10 Alpha-2A adrenoreceptor alpha-2A adrenergic receptor [Homo sapiens]
Type:Enzyme
Mol. Mass.:48979.91
Organism:Homo sapiens (Human)
Description:P08913
Residue:450
Component 3
Name:Alpha-2C adrenergic receptor
Synonyms:ADA2C_HUMAN ADRA2L2 Adrenergic alpha2C Adrenergic receptor alpha Alpha-2 adrenergic receptor subtype C4 Alpha-2C adrenoreceptor | adrenergic, alpha-2C-, receptor [Homo sapiens]
Type:Enzyme
Mol. Mass.:49552.32
Organism:Homo sapiens (Human)
Description:P18825
Residue:462
BDBM50052880
NameBDBM50052880
Synonyms:CHEMBL49137 | Imidazolidin-2-ylidene-(5-methyl-quinoxalin-6-yl)-amine
TypeSmall organic molecule
Emp. Form.C12H13N5
Mol. Mass.227.2651
SMILES[#6]-c1c(ccc2nccnc12)\[#7]=[#6]-1\[#7]-[#6]-[#6]-[#7]-1