Reaction Details
TargetAlpha-2A adrenergic receptor
LigandBDBM50052880
Substrate/Competitorn/a
Meas. Tech.ChEMBL_33194 (CHEMBL642221)
EC50 1.2±n/a nM
Citation  TBA Bioorg Med Chem Lett5:2255-2258 (1995)  
 
Alpha-2A adrenergic receptor
Name:Alpha-2A adrenergic receptor
Type:Enzyme
Mol. Mass.:48979.91
Organism:Homo sapiens (Human)
Description:P08913
Residue:465
BDBM50052880
NameBDBM50052880
Synonyms:CHEMBL49137 | Imidazolidin-2-ylidene-(5-methyl-quinoxalin-6-yl)-amine
TypeSmall organic molecule
Emp. Form.C12H13N5
Mol. Mass.227.2651
SMILES[#6]-c1c(ccc2nccnc12)\[#7]=[#6]-1\[#7]-[#6]-[#6]-[#7]-1