Reaction Details
TargetAlpha-2A adrenergic receptor
LigandBDBM34572
Substrate/Competitorn/a
Meas. Tech.ChEMBL_33194 (CHEMBL642221)
EC50 0.616595±n/a nM
Citation  TBA Bioorg Med Chem Lett5:2255-2258 (1995)  
 
Alpha-2A adrenergic receptor
Name:Alpha-2A adrenergic receptor
Type:Enzyme
Mol. Mass.:48979.91
Organism:Homo sapiens (Human)
Description:P08913
Residue:450
BDBM34572
NameBDBM34572
Synonyms:BRIMONIDINE MLS000069370 UK 14,304 | cid_2435
TypeSmall organic molecule
Emp. Form.C11H10BrN5
Mol. Mass.292.135
SMILESBrc1c(NC2=NCCN2)ccc2nccnc12