Reaction Details
TargetAdenosine receptor A2b
LigandBDBM60917
Substrate/Competitorn/a
Meas. Tech.ChEMBL_32937 (CHEMBL646079)
Ki 35±n/a nM
Citation  TBA Bioorg Med Chem Lett5:2371-2376 (1995)  
 
Adenosine receptor A2b
Name:Adenosine receptor A2b
Type:PROTEIN
Mol. Mass.:36378.84
Organism:Rattus norvegicus
Description:ChEMBL_32934
Residue:332
BDBM60917
NameBDBM60917
Synonyms:9-chloranyl-5-(4-hydroxyphenyl)-2,3,4,5-tetrahydro-1H-3-benzazepine-7,8-diol;methanesulfonic acid 9-chloro-5-(4-hydroxyphenyl)-2,3,4,5-tetrahydro-1H-3-benzazepine-7,8-diol;methanesulfonic acid FENOLDOPAM MESYLATE SMR000469190 | cid_49659
TypeSmall organic molecule
Emp. Form.C16H16ClNO3
Mol. Mass.305.756
SMILESOc1ccc(cc1)C1CNCCc2c(Cl)c(O)c(O)cc12