Reaction Details
TargetDNA topoisomerase 2-alpha/2-beta
LigandBDBM50212758
Substrate/Competitorn/a
Meas. Tech.ChEMBL_225786 (CHEMBL847692)
EC50 980±n/a nM
Citation  TBA Bioorg Med Chem Lett5:399-404 (1995)  
 
DNA topoisomerase 2-alpha/2-beta
Name:DNA topoisomerase 2-alpha/2-beta
Synonyms:DNA topoisomerase II
Type:n/a
Mol. Mass.:n/a
Description:ASSAY_ID of ChEMBL is 1821483
Components:This complex has 2 components.
Component 1
Name:DNA topoisomerase 2-alpha
Type:Protein
Mol. Mass.:174415.30
Organism:Homo sapiens (Human)
Description:P11388
Residue:1531
Component 2
Name:DNA topoisomerase 2-beta
Synonyms:DNA topoisomerase II TOP2B | TOP2B_HUMAN
Type:PROTEIN
Mol. Mass.:183284.13
Organism:Homo sapiens (Human)
Description:ChEMBL_51583
Residue:1626
BDBM50212758
NameBDBM50212758
Synonyms:CHEMBL133780
TypeSmall organic molecule
Emp. Form.C24H21F2N5
Mol. Mass.417.4538
SMILESCc1cc(cc(C)n1)-c1c(F)cc2c(c1F)n(cc\c2=N/Nc1ccccn1)C1CC1