Reaction Details
Target5-hydroxytryptamine receptor 3A/3B
LigandBDBM50033437
Substrate/Competitorn/a
Meas. Tech.ChEMBL_3165 (CHEMBL617810)
IC50 4100±n/a nM
Citation  TBA Bioorg Med Chem Lett6:1825-1830 (1996)  
 
5-hydroxytryptamine receptor 3A/3B
Name:5-hydroxytryptamine receptor 3A/3B
Type:n/a
Mol. Mass.:n/a
Description:ASSAY_ID of EBI is 2974
Components:This complex has 2 components.
Component 1
Name:5-hydroxytryptamine receptor 3B
Synonyms:5HT3B_RAT Serotonin (5-HT) receptor
Type:PROTEIN
Mol. Mass.:50328.78
Organism:Rattus norvegicus
Description:EBI_11885
Residue:437
Component 2
Name:5-hydroxytryptamine receptor 3A
Synonyms:5-HT3 5HT3A_RAT Htr3 Serotonin (5-HT) receptor | Zacopride site-R
Type:Enzyme Catalytic Domain
Mol. Mass.:55428.70
Organism:RAT
Description:5-HT3 HTR3A RAT::P35563
Residue:483
BDBM50033437
NameBDBM50033437
Synonyms:CHEMBL905 N,N-dimethyl-2-[5-(1,2,4-triazol-1-ylmethyl)-1H-indol-3-yl]-ethanamine N,N-dimethyl-5-(1H-1,2,4-triazol-1-ylmethyl)-1H-indole-3-ethanamine risatriptan
TypeSmall organic molecule
Emp. Form.C15H19N5
Mol. Mass.269.3449
SMILESCN(C)CCc1c[nH]c2ccc(Cn3cncn3)cc12