Reaction Details
Target5-hydroxytryptamine receptor 1A
LigandBDBM50407356
Substrate/Competitorn/a
Meas. Tech.ChEBML_1074
IC50 25±n/a nM
Citation  TBA Bioorg Med Chem Lett6:1825-1830 (1996)  
 
5-hydroxytryptamine receptor 1A
Name:5-hydroxytryptamine receptor 1A
Type:n/a
Mol. Mass.:46122.49
Organism:Homo sapiens (Human)
Description:n/a
Residue:422
BDBM50407356
NameBDBM50407356
Synonyms:CHEMBL54265
TypeSmall organic molecule
Emp. Form.C14H17N5
Mol. Mass.255.3183
SMILESCN(C)CCc1c[nH]c2ccc(cc12)-n1cncn1