Reaction Details
Target5-hydroxytryptamine receptor 2C
LigandBDBM50407356
Substrate/Competitorn/a
Meas. Tech.ChEBML_2788
IC50 500±n/a nM
Citation  TBA Bioorg Med Chem Lett6:1825-1830 (1996)  
 
5-hydroxytryptamine receptor 2C
Name:5-hydroxytryptamine receptor 2C
Type:G Protein-Coupled Receptor (GPCR)
Mol. Mass.:51836.79
Organism:Homo sapiens (Human)
Description:P28335
Residue:458
BDBM50407356
NameBDBM50407356
Synonyms:CHEMBL54265
TypeSmall organic molecule
Emp. Form.C14H17N5
Mol. Mass.255.3183
SMILESCN(C)CCc1c[nH]c2ccc(cc12)-n1cncn1