Reaction Details
Target5-hydroxytryptamine receptor 3A/3B
LigandBDBM50060426
Substrate/Competitorn/a
Meas. Tech.ChEBML_3165
IC50>10000±n/a nM
Citation  TBA Bioorg Med Chem Lett6:1825-1830 (1996)  
 
5-hydroxytryptamine receptor 3A/3B
Name:5-hydroxytryptamine receptor 3A/3B
Type:n/a
Mol. Mass.:n/a
Description:ASSAY_ID of EBI is 2974
Components:This complex has 2 components.
Component 1
Name:5-hydroxytryptamine receptor 3B
Synonyms:5HT3B_RAT Serotonin (5-HT) receptor
Type:PROTEIN
Mol. Mass.:50328.78
Organism:Rattus norvegicus
Description:EBI_11885
Residue:437
Component 2
Name:5-hydroxytryptamine receptor 3A
Synonyms:5-HT3 5HT3A_RAT Htr3 Serotonin (5-HT) receptor | Zacopride site-R
Type:Enzyme Catalytic Domain
Mol. Mass.:55428.70
Organism:RAT
Description:5-HT3 HTR3A RAT::P35563
Residue:483
BDBM50060426
NameBDBM50060426
Synonyms:CHEMBL296161 L-741604
TypeSmall organic molecule
Emp. Form.C14H17N5
Mol. Mass.255.3183
SMILESCN(C)CCc1c[nH]c2ccc(cc12)-n1cnnc1