Reaction Details
Target5-hydroxytryptamine receptor 3A
LigandBDBM50031475
Substrate/Competitorn/a
Meas. Tech.ChEBML_3475
Ki 5.0±n/a nM
Citation  TBA Bioorg Med Chem Lett6:477-480 (1996)  
 
5-hydroxytryptamine receptor 3A
Name:5-hydroxytryptamine receptor 3A
Type:Protein
Mol. Mass.:55283.27
Organism:Homo sapiens (Human)
Description:P46098
Residue:478
BDBM50031475
NameBDBM50031475
Synonyms:4-Amino-N-(1-aza-bicyclo[2.2.2]oct-3-yl)-5-chloro-2-((R)-methoxy)-benzamide 4-Amino-N-(R)-1-aza-bicyclo[2.2.2]oct-3-yl-5-chloro-2-methoxy-benzamide ZACOPRIDE,S
TypeSmall organic molecule
Emp. Form.C15H20ClN3O2
Mol. Mass.309.791
SMILESCOc1cc(N)c(Cl)cc1C(=O)N[C@H]1CN2CCC1CC2