Reaction Details
TargetSubstance-P receptor
LigandBDBM50408664
Substrate/Competitorn/a
Meas. Tech.ChEMBL_143039 (CHEMBL750288)
Ki 0.025119±n/a nM
Citation  TBA Bioorg Med Chem Lett6:1015-1020 (1996)  
 
Substance-P receptor
Name:Substance-P receptor
Type:G Protein-Coupled Receptor (GPCR)
Mol. Mass.:46254.43
Organism:Homo sapiens (Human)
Description:P25103
Residue:407
BDBM50408664
NameBDBM50408664
Synonyms:GR-205171 | VOFOPITANT
TypeSmall organic molecule
Emp. Form.C21H23F3N6O
Mol. Mass.432.4421
SMILESCOc1ccc(cc1CN[C@H]1CCCN[C@H]1c1ccccc1)-n1nnnc1C(F)(F)F