Reaction Details
TargetSubstance-P receptor
LigandBDBM50213832
Substrate/Competitorn/a
Meas. Tech.ChEMBL_143039 (CHEMBL750288)
Ki 0.039811±n/a nM
Citation  TBA Bioorg Med Chem Lett6:1015-1020 (1996)  
 
Substance-P receptor
Name:Substance-P receptor
Type:G Protein-Coupled Receptor (GPCR)
Mol. Mass.:46254.43
Organism:Homo sapiens (Human)
Description:P25103
Residue:407
BDBM50213832
NameBDBM50213832
Synonyms:CHEMBL545594
TypeSmall organic molecule
Emp. Form.C21H28Cl2N6OS
Mol. Mass.483.458
SMILESCl.Cl.COc1ccc(cc1CN[C@H]1CCCN[C@H]1c1ccccc1)-n1nnnc1SC