Reaction Details
TargetE-selectin
LigandBDBM50215367
Substrate/Competitorn/a
Meas. Tech.ChEMBL_199713 (CHEMBL802069)
IC50 90200±n/a nM
Citation  TBA Bioorg Med Chem Lett7:985-988 (1997)  
 
E-selectin
Name:E-selectin
Type:PROTEIN
Mol. Mass.:66642.96
Organism:Homo sapiens (Human)
Description:ChEMBL_1438995
Residue:610
BDBM50215367
NameBDBM50215367
Synonyms:CHEMBL3215456
TypeSmall organic molecule
Emp. Form.C49H70N3NaO24
Mol. Mass.1108.0756
SMILES[Na+].C[C@@H]1O[C@@H](O[C@@H]2[C@H](NC(=O)c3ccc4ccccc4c3)[C@H](OCCCCCCNC(=O)C=C)O[C@@H](CO)[C@H]2O[C@@H]2O[C@@H](CO)[C@H](O)[C@H](O[C@@]3(C[C@@H](O)[C@@H](NC(C)=O)[C@@H](O3)[C@H](O)[C@H](O)CO)C([O-])=O)[C@@H]2O)[C@@H](O)[C@@H](O)[C@@H]1O