Reaction Details
TargetGlutamate receptor ionotropic, NMDA 1
LigandBDBM50010475
Substrate/Competitorn/a
Meas. Tech.ChEBML_140329
Ki 8.50±n/a nM
Citation Giacobbe, SABaraldi, DDi Fabio, R Unusual synthesis of new glycine antagonists via sequential aldol condensation-lactonization-elimination reaction. Bioorg Med Chem Lett8:1689-92 (1998) Glutamate receptor ionotropic, NMDA 1
Name:Glutamate receptor ionotropic, NMDA 1
Type:Enzyme Catalytic Domain
Mol. Mass.:105533.40
Organism:RAT
Description:P35439
Residue:938
BDBM50010475
NameBDBM50010475
Synonyms:GAVESTINEL | GV-150526X
TypeSmall organic molecule
Emp. Form.C18H12Cl2N2O3
Mol. Mass.375.205
SMILESOC(=O)c1[nH]c2cc(Cl)cc(Cl)c2c1\C=C\C(=O)Nc1ccccc1