Reaction Details
TargetD(3) dopamine receptor
LigandBDBM50216353
Substrate/Competitorn/a
Meas. Tech.ChEMBL_62588 (CHEMBL673116)
Ki 16±n/a nM
Citation Avenell, KYBoyfield, IColdwell, MCHadley, MSHealy, MAJeffrey, PMJohnson, CNNash, DJRiley, GJScott, EESmith, SAStacey, RStemp, GThewlis, KM Fused aminotetralins: novel antagonists with high selectivity for the dopamine D3 receptor. Bioorg Med Chem Lett8:2859-64 (1998) D(3) dopamine receptor
Name:D(3) dopamine receptor
Type:n/a
Mol. Mass.:44243.43
Organism:Homo sapiens (Human)
Description:n/a
Residue:400
BDBM50216353
NameBDBM50216353
Synonyms:CHEMBL98452
TypeSmall organic molecule
Emp. Form.C29H32N2O
Mol. Mass.424.5772
SMILES[H][C@]12CCc3ccccc3[C@]1([H])CCN2CCCCNC(=O)c1ccc(cc1)-c1ccccc1