Reaction Details
TargetD(3) dopamine receptor
LigandBDBM50216351
Substrate/Competitorn/a
Meas. Tech.ChEMBL_62588 (CHEMBL673116)
Ki 10.0±n/a nM
Citation Avenell, KYBoyfield, IColdwell, MCHadley, MSHealy, MAJeffrey, PMJohnson, CNNash, DJRiley, GJScott, EESmith, SAStacey, RStemp, GThewlis, KM Fused aminotetralins: novel antagonists with high selectivity for the dopamine D3 receptor. Bioorg Med Chem Lett8:2859-64 (1998) D(3) dopamine receptor
Name:D(3) dopamine receptor
Type:n/a
Mol. Mass.:44243.43
Organism:Homo sapiens (Human)
Description:n/a
Residue:400
BDBM50216351
NameBDBM50216351
Synonyms:CHEMBL2111592
TypeSmall organic molecule
Emp. Form.C31H36N2O4S
Mol. Mass.532.694
SMILESCS(=O)(=O)Oc1cccc2C3CCCN(CCCCNC(=O)c4ccc(cc4)-c4ccccc4)C3CCc12