Reaction Details
TargetD(2) dopamine receptor
LigandBDBM50132022
Substrate/Competitorn/a
Meas. Tech.ChEMBL_60532 (CHEMBL674943)
Ki 25±n/a nM
Citation Avenell, KYBoyfield, IColdwell, MCHadley, MSHealy, MAJeffrey, PMJohnson, CNNash, DJRiley, GJScott, EESmith, SAStacey, RStemp, GThewlis, KM Fused aminotetralins: novel antagonists with high selectivity for the dopamine D3 receptor. Bioorg Med Chem Lett8:2859-64 (1998) D(2) dopamine receptor
Name:D(2) dopamine receptor
Type:Cell-surface receptors
Mol. Mass.:50647.10
Organism:Homo sapiens (Human)
Description:P14416
Residue:443
BDBM50132022
NameBDBM50132022
Synonyms:Biphenyl-4-carboxylic acid [4-((4aS,10bS)-7-hydroxy-2,3,4a,5,6,10b-hexahydro-1H-benzo[f]quinolin-4-yl)-butyl]-amide CHEMBL99198
TypeSmall organic molecule
Emp. Form.C30H34N2O2
Mol. Mass.454.6032
SMILESOc1cccc2[C@@H]3CCCN(CCCCNC(=O)c4ccc(cc4)-c4ccccc4)[C@H]3CCc12