Reaction Details
TargetChitotriosidase-1
LigandBDBM50214360
Substrate/Competitorn/a
Meas. Tech.ChEBML_49251
IC50 41.1±n/a nM
Citation Sakuda, SSakurada, M Preparation of biotinylated allosamidins with strong chitinase inhibitory activities. Bioorg Med Chem Lett8:2987-90 (1998) Chitotriosidase-1
Name:Chitotriosidase-1
Type:Enzyme
Mol. Mass.:51682.25
Organism:Homo sapiens (Human)
Description:Q13231
Residue:466
BDBM50214360
NameBDBM50214360
Synonyms:CHEMBL327266
TypeSmall organic molecule
Emp. Form.C41H67N9O16S
Mol. Mass.974.086
SMILES[H][C@@]12CSC(CCCCC(=O)NCCCCCC(=O)N\N=C\C(NC(C)=O)C(OC(CO)C=O)OC3C(CO)OC(OC4C(O)C5N=C(OC5C4CO)N(C)C)C(NC(C)=O)C3O)[C@]1([H])NC(=O)N2