Reaction Details
TargetGenome polyprotein
LigandBDBM50158841
Substrate/Competitorn/a
Meas. Tech.ChEMBL_79050 (CHEMBL687026)
IC50 24600±n/a nM
Citation Chu, MMierzwa, RHe, LKing, APatel, MPichardo, JHart, AButkiewicz, NPuar, MS Isolation and structure of SCH 351633: a novel hepatitis C virus (HCV) NS3 protease inhibitor from the fungus Penicillium griseofulvum. Bioorg Med Chem Lett9:1949-52 (1999) Genome polyprotein
Name:Genome polyprotein
Type:Protein
Mol. Mass.:67067.41
Organism:Hepatitis C virus
Description:A3EZI9
Residue:631
BDBM50158841
NameBDBM50158841
Synonyms:4-Hydroxy-4H,6H-furo[3,2-c]pyran-2-one CHEMBL294018 patulin
TypeSmall organic molecule
Emp. Form.C7H6O4
Mol. Mass.154.1201
SMILESOC1OCC=C2OC(=O)C=C12