Reaction Details
TargetD(3) dopamine receptor
LigandBDBM50217146
Substrate/Competitorn/a
Meas. Tech.ChEBML_62601
Ki 3.2±n/a nM
Citation Avenell, KYBoyfield, IHadley, MSJohnson, CNNash, DJRiley, GJStemp, G Heterocyclic analogues of 2-aminotetralins with high affinity and selectivity for the dopamine D3 receptor. Bioorg Med Chem Lett9:2715-20 (1999) D(3) dopamine receptor
Name:D(3) dopamine receptor
Type:n/a
Mol. Mass.:44243.43
Organism:Homo sapiens (Human)
Description:n/a
Residue:400
BDBM50217146
NameBDBM50217146
Synonyms:CHEMBL91156
TypeSmall organic molecule
Emp. Form.C27H34N4O
Mol. Mass.430.5851
SMILESCCCN(CCCCNC(=O)c1ccc(cc1)-c1ccccc1)C1CCc2n[nH]cc2C1