Reaction Details
TargetD(3) dopamine receptor
LigandBDBM50217154
Substrate/Competitorn/a
Meas. Tech.ChEMBL_62457 (CHEMBL679229)
Ki 4.0±n/a nM
Citation Austin, NEAvenell, KYBoyfield, IBranch, CLColdwell, MCHadley, MSJeffrey, PJohns, AJohnson, CNNash, DJRiley, GJSmith, SAStacey, RCStemp, GThewlis, KMVong, AK Novel 1,2,3,4-tetrahydroisoquinolines with high affinity and selectivity for the dopamine D3 receptor. Bioorg Med Chem Lett9:179-84 (1999) D(3) dopamine receptor
Name:D(3) dopamine receptor
Type:n/a
Mol. Mass.:44243.43
Organism:Homo sapiens (Human)
Description:n/a
Residue:400
BDBM50217154
NameBDBM50217154
Synonyms:CHEMBL293347
TypeSmall organic molecule
Emp. Form.C25H27F3N2O5S
Mol. Mass.524.552
SMILESCC(=O)c1ccc(\C=C\C(=O)NCCCCN2CCc3ccc(OS(=O)(=O)C(F)(F)F)cc3C2)cc1