Reaction Details
TargetD(3) dopamine receptor
LigandBDBM50217160
Substrate/Competitorn/a
Meas. Tech.ChEMBL_62457 (CHEMBL679229)
Ki 3.2±n/a nM
Citation Austin, NEAvenell, KYBoyfield, IBranch, CLColdwell, MCHadley, MSJeffrey, PJohns, AJohnson, CNNash, DJRiley, GJSmith, SAStacey, RCStemp, GThewlis, KMVong, AK Novel 1,2,3,4-tetrahydroisoquinolines with high affinity and selectivity for the dopamine D3 receptor. Bioorg Med Chem Lett9:179-84 (1999) D(3) dopamine receptor
Name:D(3) dopamine receptor
Type:n/a
Mol. Mass.:44243.43
Organism:Homo sapiens (Human)
Description:n/a
Residue:400
BDBM50217160
NameBDBM50217160
Synonyms:CHEMBL52468
TypeSmall organic molecule
Emp. Form.C26H26F3N3O4S
Mol. Mass.533.563
SMILESFC(F)(F)S(=O)(=O)Oc1ccc2CCN(CCCCNC(=O)\C=C\c3ccc4ncccc4c3)Cc2c1