Reaction Details
TargetD(3) dopamine receptor
LigandBDBM50217169
Substrate/Competitorn/a
Meas. Tech.ChEMBL_62457 (CHEMBL679229)
Ki 2.0±n/a nM
Citation Austin, NEAvenell, KYBoyfield, IBranch, CLColdwell, MCHadley, MSJeffrey, PJohns, AJohnson, CNNash, DJRiley, GJSmith, SAStacey, RCStemp, GThewlis, KMVong, AK Novel 1,2,3,4-tetrahydroisoquinolines with high affinity and selectivity for the dopamine D3 receptor. Bioorg Med Chem Lett9:179-84 (1999) D(3) dopamine receptor
Name:D(3) dopamine receptor
Type:n/a
Mol. Mass.:44243.43
Organism:Homo sapiens (Human)
Description:n/a
Residue:400
BDBM50217169
NameBDBM50217169
Synonyms:CHEMBL279925
TypeSmall organic molecule
Emp. Form.C30H29F3N4O5S
Mol. Mass.614.635
SMILESCc1nnc(o1)-c1ccc(cc1)-c1ccc(cc1)C(=O)NCCCCN1CCc2ccc(OS(=O)(=O)C(F)(F)F)cc2C1