Reaction Details
TargetHistamine H3 receptor
LigandBDBM50217236
Substrate/Competitorn/a
Meas. Tech.ChEMBL_83499 (CHEMBL694068)
Ki 2.6±n/a nM
Citation Tozer, MJBuck, IMCooke, TKalindjian, SBMcDonald, IMPether, MJSteel, KI 4-Chlorobenzyl sulfonamide and sulfamide derivatives of histamine homologues: the design of potent histamine H3 receptor antagonists. Bioorg Med Chem Lett9:3103-8 (1999) Histamine H3 receptor
Name:Histamine H3 receptor
Type:Enzyme Catalytic Domain
Mol. Mass.:48753.61
Organism:GUINEA PIG
Description:HISTAMINE H3 HRH3 GUINEA PIG::Q9JI35
Residue:445
BDBM50217236
NameBDBM50217236
Synonyms:CHEMBL105744
TypeSmall organic molecule
Emp. Form.C15H19F3N4O2S
Mol. Mass.376.397
SMILESFC(F)(F)c1ccc(CNS(=O)(=O)NCCCCc2c[nH]cn2)cc1