Reaction Details
TargetHistamine H3 receptor
LigandBDBM50217238
Substrate/Competitorn/a
Meas. Tech.ChEMBL_83499 (CHEMBL694068)
Ki 2.8±n/a nM
Citation Tozer, MJBuck, IMCooke, TKalindjian, SBMcDonald, IMPether, MJSteel, KI 4-Chlorobenzyl sulfonamide and sulfamide derivatives of histamine homologues: the design of potent histamine H3 receptor antagonists. Bioorg Med Chem Lett9:3103-8 (1999) Histamine H3 receptor
Name:Histamine H3 receptor
Type:Enzyme Catalytic Domain
Mol. Mass.:48753.61
Organism:GUINEA PIG
Description:HISTAMINE H3 HRH3 GUINEA PIG::Q9JI35
Residue:445
BDBM50217238
NameBDBM50217238
Synonyms:CHEMBL107083
TypeSmall organic molecule
Emp. Form.C14H19ClN4O2S
Mol. Mass.342.844
SMILESClc1ccc(CNS(=O)(=O)NCCCCc2c[nH]cn2)cc1