Reaction Details
TargetHistamine H3 receptor
LigandBDBM50217249
Substrate/Competitorn/a
Meas. Tech.ChEMBL_83499 (CHEMBL694068)
Ki 3.0±n/a nM
Citation Tozer, MJBuck, IMCooke, TKalindjian, SBMcDonald, IMPether, MJSteel, KI 4-Chlorobenzyl sulfonamide and sulfamide derivatives of histamine homologues: the design of potent histamine H3 receptor antagonists. Bioorg Med Chem Lett9:3103-8 (1999) Histamine H3 receptor
Name:Histamine H3 receptor
Type:Enzyme Catalytic Domain
Mol. Mass.:48753.61
Organism:GUINEA PIG
Description:HISTAMINE H3 HRH3 GUINEA PIG::Q9JI35
Residue:445
BDBM50217249
NameBDBM50217249
Synonyms:CHEMBL104646
TypeSmall organic molecule
Emp. Form.C14H18ClN3O2S
Mol. Mass.327.83
SMILESClc1ccc(CS(=O)(=O)NCCCCc2c[nH]cn2)cc1