Reaction Details
TargetSimilar to alpha-tubulin isoform 1
LigandBDBM50217333
Substrate/Competitorn/a
Meas. Tech.ChEMBL_225817 (CHEMBL844433)
IC50 19000±n/a nM
Citation Miller, TABulman, ALThompson, CDMacdonald, TL The synthesis and evaluation of temperature sensitive tubulin toxins. Bioorg Med Chem Lett9:407-12 (1999) Similar to alpha-tubulin isoform 1
Name:Similar to alpha-tubulin isoform 1
Synonyms:Similar to alpha-tubulin isoform 1
Type:PROTEIN
Mol. Mass.:10383.05
Organism:Bos taurus
Description:ChEMBL_104716
Residue:99
BDBM50217333
NameBDBM50217333
Synonyms:CHEMBL336290
TypeSmall organic molecule
Emp. Form.C20H22O5
Mol. Mass.342.3857
SMILESCOc1cc2CCC(c2c(OC)c1OC)c1cccc(OC)c(=O)c1