Reaction Details
TargetSimilar to alpha-tubulin isoform 1
LigandBDBM50217338
Substrate/Competitorn/a
Meas. Tech.ChEMBL_225816 (CHEMBL844432)
IC50 23500±n/a nM
Citation Miller, TABulman, ALThompson, CDMacdonald, TL The synthesis and evaluation of temperature sensitive tubulin toxins. Bioorg Med Chem Lett9:407-12 (1999) Similar to alpha-tubulin isoform 1
Name:Similar to alpha-tubulin isoform 1
Synonyms:Similar to alpha-tubulin isoform 1
Type:PROTEIN
Mol. Mass.:10383.05
Organism:Bos taurus
Description:ChEMBL_104716
Residue:99
BDBM50217338
NameBDBM50217338
Synonyms:CHEMBL132688
TypeSmall organic molecule
Emp. Form.C20H23NO4
Mol. Mass.341.4009
SMILESCNc1cccc(cc1=O)C1CCc2cc(OC)c(OC)c(OC)c12