Reaction Details
TargetSubstance-P receptor
LigandBDBM50217511
Substrate/Competitorn/a
Meas. Tech.ChEBML_144914
IC50 5.0±n/a nM
Citation Nishi, TFukazawa, TIshibashi, KNakajima, KSugioka, YIio, YKurata, HItoh, KMukaiyama, OSatoh, YYamaguchi, T Combined NK1 and NK2 tachykinin receptor antagonists: synthesis and structure-activity relationships of novel oxazolidine analogues. Bioorg Med Chem Lett9:875-80 (1999) Substance-P receptor
Name:Substance-P receptor
Type:Enzyme Catalytic Domain
Mol. Mass.:46261.42
Organism:GUINEA PIG
Description:Neurokinin NK1 TACR1 GUINEA PIG::P30547
Residue:407
BDBM50217511
NameBDBM50217511
Synonyms:CHEMBL172342
TypeSmall organic molecule
Emp. Form.C34H38Cl2N4O6
Mol. Mass.669.595
SMILESCOc1cc(cc(OC)c1OC)C(=O)N1CO[C@@](CCN2CCC3(CC2)N(CNC3=O)c2ccccc2)(C1)c1ccc(Cl)c(Cl)c1