Reaction Details
Target5-hydroxytryptamine receptor 2C
LigandBDBM50217989
Substrate/Competitorn/a
Meas. Tech.ChEMBL_2760 (CHEMBL617757)
Ki 1.6±n/a nM
Citation Bromidge, SMDabbs, SDavies, SDuckworth, DMForbes, ITJones, GEJones, JKing, FDSaunders, DVBlackburn, TPHolland, VKennett, GALightowler, SMiddlemiss, DNRiley, GJTrail, BWood, MD 1-[2-[(Heteroaryloxy)heteroaryl]carbamoyl]indolines: novel and selective 5-HT2C receptor inverse agonists with potential as antidepressant/anxiolytic agents. Bioorg Med Chem Lett10:1863-6 (2000) 5-hydroxytryptamine receptor 2C
Name:5-hydroxytryptamine receptor 2C
Type:G Protein-Coupled Receptor (GPCR)
Mol. Mass.:51836.79
Organism:Homo sapiens (Human)
Description:P28335
Residue:458
BDBM50217989
NameBDBM50217989
Synonyms:CHEMBL56508
TypeSmall organic molecule
Emp. Form.C22H18ClF3N4O2
Mol. Mass.462.852
SMILESCc1cc2CCN(C(=O)Nc3cnc(Oc4cccnc4C)c(Cl)c3)c2cc1C(F)(F)F