Reaction Details
TargetcAMP-specific 3',5'-cyclic phosphodiesterase 4C
LigandBDBM50218255
Substrate/Competitorn/a
Meas. Tech.ChEMBL_195885 (CHEMBL799007)
IC50 43±n/a nM
Citation Buckley, GCooper, NDyke, HJGalleway, FGowers, LGregory, JCHannah, DRHaughan, AFHellewell, PGKendall, HJLowe, CMaxey, RMontana, JGNaylor, RPicken, CLRuncie, KASabin, VTuladhar, BRWarneck, JB 7-Methoxybenzofuran-4-carboxamides as PDE 4 inhibitors: a potential treatment for asthma. Bioorg Med Chem Lett10:2137-40 (2000) cAMP-specific 3',5'-cyclic phosphodiesterase 4C
Name:cAMP-specific 3',5'-cyclic phosphodiesterase 4C
Type:PROTEIN
Mol. Mass.:60038.21
Organism:Rattus norvegicus
Description:ChEMBL_104732
Residue:536
BDBM50218255
NameBDBM50218255
Synonyms:CHEMBL290100
TypeSmall organic molecule
Emp. Form.C17H12Cl2N2O4
Mol. Mass.379.194
SMILESCOc1ccc(C(=O)Nc2c(Cl)cncc2Cl)c2cc(oc12)C(C)=O