Reaction Details
TargetSerine protease 1
LigandBDBM50218583
Substrate/Competitorn/a
Meas. Tech.ChEMBL_213034 (CHEMBL816972)
IC50 870±n/a nM
Citation Radau, GRauh, D Synthesis of a cyanopeptide-analogue with trypsin activating properties. Bioorg Med Chem Lett10:779-81 (2000) Serine protease 1
Name:Serine protease 1
Type:Enzyme
Mol. Mass.:26557.80
Organism:Homo sapiens (Human)
Description:P07477
Residue:247
BDBM50218583
NameBDBM50218583
Synonyms:CHEMBL81364
TypeSmall organic molecule
Emp. Form.C29H45ClN6O9S
Mol. Mass.689.22
SMILES[#6]-[#6]-[#6](-[#6])-[#6](-[#7]-[#6](=O)-[#6](-[#8])-[#6]-c1ccc(-[#8])c(Cl)c1)-[#6](=O)-[#7]-1-[#6]-2-[#6]-[#6](-[#6]-[#6]-[#6]-2-[#6]-[#6]-1-[#6](=O)-[#7]-[#6]-[#6]-[#6]-[#6]\[#7]=[#6](\[#7])-[#7])-[#8]S([#8])(=O)=O