Reaction Details
TargetD(2) dopamine receptor
LigandBDBM21398
Substrate/Competitorn/a
Meas. Tech.ChEMBL_61147 (CHEMBL670684)
Ki 0.794328±n/a nM
Citation Talaga, PMatagne, AKlitgaard, H Pharmacological evaluation of a diarylmethylene-piperidine derivative: a new potent atypical antipsychotic? Bioorg Med Chem Lett11:1313-6 (2001) D(2) dopamine receptor
Name:D(2) dopamine receptor
Type:Cell-surface receptors
Mol. Mass.:50647.10
Organism:Homo sapiens (Human)
Description:P14416
Residue:443
BDBM21398
NameBDBM21398
Synonyms:4-[4-(4-Chloro-phenyl)-4-hydroxy-piperidin-1-yl]-1-(4-fluoro-phenyl)-butan-1-one;propionate(HCl) CHEMBL54 Haloperidol | Haloperidol, 1
TypeSmall organic molecule
Emp. Form.C21H23ClFNO2
Mol. Mass.375.864
SMILESOC1(CCN(CCCC(=O)c2ccc(F)cc2)CC1)c1ccc(Cl)cc1