Reaction Details
TargetBeta-1/Beta-2/Beta-3 adrenergic receptor
LigandBDBM96235
Substrate/Competitorn/a
Meas. Tech.ChEMBL_39017 (CHEMBL652670)
IC50 98±n/a nM
Citation Masubuchi, MKawasaki, KEbiike, HIkeda, YTsujii, SSogabe, SFujii, TSakata, KShiratori, YAoki, YOhtsuka, TShimma, N Design and synthesis of novel benzofurans as a new class of antifungal agents targeting fungal N-myristoyltransferase. Part 1. Bioorg Med Chem Lett11:1833-7 (2001) Beta-1/Beta-2/Beta-3 adrenergic receptor
Name:Beta-1/Beta-2/Beta-3 adrenergic receptor
Synonyms:Adrenergic receptor beta
Type:n/a
Mol. Mass.:n/a
Description:ASSAY_ID of ChEMBL is 305577
Components:This complex has 3 components.
Component 1
Name:Beta-2 adrenergic receptor
Type:n/a
Mol. Mass.:46461.69
Organism:Homo sapiens (Human)
Description:P07550
Residue:413
Component 2
Name:Beta-1 adrenergic receptor
Synonyms:ADRB1 ADRB1_HUMAN Beta-1 adrenoceptor adrenergic Beta1
Type:G Protein-Coupled Receptor (GPCR)
Mol. Mass.:51338.40
Organism:Homo sapiens (Human)
Description:P08588
Residue:477
Component 3
Name:Beta-3 adrenergic receptor
Synonyms:ADRB3 ADRB3_HUMAN Beta-2 adrenergic receptor and beta-3 adrenergic receptor Beta-3 adrenoreceptor | adrenergic Beta3
Type:G Protein-Coupled Receptor (GPCR)
Mol. Mass.:43534.88
Organism:Homo sapiens (Human)
Description:n/a
Residue:408
BDBM96235
NameBDBM96235
Synonyms:4-[2-hydroxy-3-(isopropylamino)propoxy]-3-methyl-coumarilic acid ethyl ester;hydrochloride CHEMBL53849 Non peptidic, 1 cid_6602742 ethyl 4-[2-hydroxy-3-(propan-2-ylamino)propoxy]-3-methyl-1-benzofuran-2-carboxylate;hydrochloride
TypeSmall organic molecule
Emp. Form.C18H25NO5
Mol. Mass.335.3948
SMILESCCOC(=O)c1oc2cccc(OCC(O)CNC(C)C)c2c1C