Reaction Details
Target5-hydroxytryptamine receptor 2B
LigandBDBM50218749
Substrate/Competitorn/a
Meas. Tech.ChEMBL_2890 (CHEMBL617608)
Ki 32±n/a nM
Citation Porter, RAChan, WNCoulton, SJohns, AHadley, MSWiddowson, KJerman, JCBrough, SJColdwell, MSmart, DJewitt, FJeffrey, PAustin, N 1,3-Biarylureas as selective non-peptide antagonists of the orexin-1 receptor. Bioorg Med Chem Lett11:1907-10 (2001) 5-hydroxytryptamine receptor 2B
Name:5-hydroxytryptamine receptor 2B
Type:G Protein-Coupled Receptor (GPCR)
Mol. Mass.:54312.47
Organism:Homo sapiens (Human)
Description:Receptor binding assays were performed using human clone stably expressed in CHO cells.
Residue:481
BDBM50218749
NameBDBM50218749
Synonyms:CHEMBL54062
TypeSmall organic molecule
Emp. Form.C17H15N3OS
Mol. Mass.309.386
SMILESCSc1ccc(NC(=O)Nc2ccnc3ccccc23)cc1